Merge branch 'f-boot-tour' into f-fix-110

4 jobs for f-fix-110 in 1 minute and 24 seconds (queued for 4 seconds)
latest
Status Job ID Name Coverage
  Linting
failed #32070
docker allowed to fail
linting

00:00:29

 
  Test
failed #32071
docker
test

00:00:55

passed #32072
docker
test-server-side-scripting

00:00:24

 
  Deploy
skipped #32073
docker
trigger_build
 
Name Stage Failure
failed
test Test
Exiting due to channel error.
THE TESTS FAILED. PLEASE REVIEW screenshot.xwd FOR DETAILS.
make: *** [Makefile:124: run-qunit] Error 1
Uploading artifacts...
public/qunit.log: found 1 matching files
WARNING: screenlog.*: no matching files
screenshot.*: found 1 matching files

Uploading artifacts to coordinator... ok
id=32071 responseStatus=201 Created token=Gp9cjou-
ERROR: Job failed: exit code 1
failed
linting Linting
misc/entity_state_test_data.py:110:23: E1101: Module 'caosdb' has no 'State' member (no-member)
misc/entity_state_test_data.py:122:26: E1101: Module 'caosdb' has no 'State' member (no-member)
misc/entity_state_test_data.py:183:15: E1101: Module 'caosdb' has no 'State' member (no-member)

-----------------------------------
Your code has been rated at 7.80/10

make: *** [Makefile:327: pylint] Error 1
ERROR: Job failed: exit code 1